{"text_format":"1","workbook":"xlsx","n_sheets":2,"sheets":["查詢畫面","中獎名單"],"not_rendered":{"charts":0,"images":1,"macros":1,"external_links":0,"defined_names":0,"comments":0,"pivot_tables":0},"unopened":[],"bounds":{"document_bytes":16777216,"sheet_cells":100000,"rows_first":2000,"rows_last":500,"rows_between":2000,"halvings":0,"cell_chars":16384,"cell_head_chars":4096},"cells_cut":0,"cells_raw":0,"read":"whole","date_system":"1900"}

{"sheet":"查詢畫面","index":0,"n_rows":13,"n_cols":4,"rows_kept":13,"cut":false,"hidden":false,"merged":[]}
[null,null,null,"摸彩券號碼查詢程式\n\n使用說明：\n1.一次可輸入10筆資料，可同時查詢中獎結果\n2.在綠色格子輸入獎號，按Enter。即可查詢結果\n3.下方「清除號碼」按鈕，可清除綠色格子之內容"]
[]
[null,null,"↓  輸入「摸彩券號碼」後按Enter  ↓","結果"]
[null,1,null,{"$f":"IFERROR(VLOOKUP(C4,中獎名單!$B$2:$C$247,2,FALSE),\"未中獎\")","v":"未中獎"}]
[null,2,null,{"$f":"IFERROR(VLOOKUP(C5,中獎名單!$B$2:$C$247,2,FALSE),\"未中獎\")","v":"未中獎"}]
[null,3,null,{"$f":"IFERROR(VLOOKUP(C6,中獎名單!$B$2:$C$247,2,FALSE),\"未中獎\")","v":"未中獎"}]
[null,4,null,{"$f":"IFERROR(VLOOKUP(C7,中獎名單!$B$2:$C$247,2,FALSE),\"未中獎\")","v":"未中獎"}]
[null,5,null,{"$f":"IFERROR(VLOOKUP(C8,中獎名單!$B$2:$C$247,2,FALSE),\"未中獎\")","v":"未中獎"}]
[null,6,null,{"$f":"IFERROR(VLOOKUP(C9,中獎名單!$B$2:$C$247,2,FALSE),\"未中獎\")","v":"未中獎"}]
[null,7,null,{"$f":"IFERROR(VLOOKUP(C10,中獎名單!$B$2:$C$247,2,FALSE),\"未中獎\")","v":"未中獎"}]
[null,8,null,{"$f":"IFERROR(VLOOKUP(C11,中獎名單!$B$2:$C$247,2,FALSE),\"未中獎\")","v":"未中獎"}]
[null,9,null,{"$f":"IFERROR(VLOOKUP(C12,中獎名單!$B$2:$C$247,2,FALSE),\"未中獎\")","v":"未中獎"}]
[null,10,null,{"$f":"IFERROR(VLOOKUP(C13,中獎名單!$B$2:$C$247,2,FALSE),\"未中獎\")","v":"未中獎"}]

{"sheet":"中獎名單","index":1,"n_rows":247,"n_cols":3,"rows_kept":247,"cut":false,"hidden":true,"merged":[]}
["序號","號碼","獎項"]
[1,492954,"1獎：購物金30萬元"]
[2,76243,"2獎：Dyson吹風機"]
[3,388654,{"$f":"$C$3","v":"2獎：Dyson吹風機"}]
[4,493589,{"$f":"$C$3","v":"2獎：Dyson吹風機"}]
[5,763661,"2獎：Dyson吹風機"]
[6,794267,"2獎：Dyson吹風機"]
[7,10664,"3獎：聲寶多功能電火鍋"]
[8,10950,{"$f":"$C$8","v":"3獎：聲寶多功能電火鍋"}]
[9,50270,{"$f":"$C$8","v":"3獎：聲寶多功能電火鍋"}]
[10,91461,"3獎：聲寶多功能電火鍋"]
[11,286244,"3獎：聲寶多功能電火鍋"]
[12,302883,"3獎：聲寶多功能電火鍋"]
[13,318863,"3獎：聲寶多功能電火鍋"]
[14,343910,"3獎：聲寶多功能電火鍋"]
[15,548103,"3獎：聲寶多功能電火鍋"]
[16,836917,"3獎：聲寶多功能電火鍋"]
[17,4538,"4獎：風騰14吋立扇"]
[18,14734,{"$f":"$C$18","v":"4獎：風騰14吋立扇"}]
[19,49668,{"$f":"$C$18","v":"4獎：風騰14吋立扇"}]
[20,93835,"4獎：風騰14吋立扇"]
[21,123718,"4獎：風騰14吋立扇"]
[22,129319,"4獎：風騰14吋立扇"]
[23,135696,"4獎：風騰14吋立扇"]
[24,258818,"4獎：風騰14吋立扇"]
[25,283924,"4獎：風騰14吋立扇"]
[26,289819,"4獎：風騰14吋立扇"]
[27,306011,"4獎：風騰14吋立扇"]
[28,312821,"4獎：風騰14吋立扇"]
[29,382013,"4獎：風騰14吋立扇"]
[30,385002,"4獎：風騰14吋立扇"]
[31,389014,"4獎：風騰14吋立扇"]
[32,398127,"4獎：風騰14吋立扇"]
[33,408052,"4獎：風騰14吋立扇"]
[34,417300,"4獎：風騰14吋立扇"]
[35,449926,"4獎：風騰14吋立扇"]
[36,494978,"4獎：風騰14吋立扇"]
[37,495651,"4獎：風騰14吋立扇"]
[38,625521,"4獎：風騰14吋立扇"]
[39,633039,"4獎：風騰14吋立扇"]
[40,639136,"4獎：風騰14吋立扇"]
[41,646014,"4獎：風騰14吋立扇"]
[42,649805,"4獎：風騰14吋立扇"]
[43,793589,"4獎：風騰14吋立扇"]
[44,795530,"4獎：風騰14吋立扇"]
[45,851511,"4獎：風騰14吋立扇"]
[46,853791,"4獎：風騰14吋立扇"]
[47,4968,"5獎：穀王購物金100元"]
[48,6448,{"$f":"$C$48","v":"5獎：穀王購物金100元"}]
[49,27642,{"$f":"$C$48","v":"5獎：穀王購物金100元"}]
[50,29728,"5獎：穀王購物金100元"]
[51,44566,"5獎：穀王購物金100元"]
[52,45526,"5獎：穀王購物金100元"]
[53,47445,"5獎：穀王購物金100元"]
[54,47758,"5獎：穀王購物金100元"]
[55,48889,"5獎：穀王購物金100元"]
[56,49221,"5獎：穀王購物金100元"]
[57,49348,"5獎：穀王購物金100元"]
[58,67120,"5獎：穀王購物金100元"]
[59,75012,"5獎：穀王購物金100元"]
[60,87823,"5獎：穀王購物金100元"]
[61,112190,"5獎：穀王購物金100元"]
[62,115053,"5獎：穀王購物金100元"]
[63,115680,"5獎：穀王購物金100元"]
[64,115780,"5獎：穀王購物金100元"]
[65,128617,"5獎：穀王購物金100元"]
[66,131280,"5獎：穀王購物金100元"]
[67,132043,"5獎：穀王購物金100元"]
[68,134164,"5獎：穀王購物金100元"]
[69,135918,"5獎：穀王購物金100元"]
[70,137176,"5獎：穀王購物金100元"]
[71,137208,"5獎：穀王購物金100元"]
[72,140830,"5獎：穀王購物金100元"]
[73,143443,"5獎：穀王購物金100元"]
[74,145413,"5獎：穀王購物金100元"]
[75,212153,"5獎：穀王購物金100元"]
[76,219992,"5獎：穀王購物金100元"]
[77,237836,"5獎：穀王購物金100元"]
[78,251196,"5獎：穀王購物金100元"]
[79,254120,"5獎：穀王購物金100元"]
[80,254972,"5獎：穀王購物金100元"]
[81,256440,"5獎：穀王購物金100元"]
[82,281198,"5獎：穀王購物金100元"]
[83,281577,"5獎：穀王購物金100元"]
[84,282032,"5獎：穀王購物金100元"]
[85,283853,"5獎：穀王購物金100元"]
[86,286235,"5獎：穀王購物金100元"]
[87,288695,"5獎：穀王購物金100元"]
[88,289462,"5獎：穀王購物金100元"]
[89,289544,"5獎：穀王購物金100元"]
[90,304545,"5獎：穀王購物金100元"]
[91,308025,"5獎：穀王購物金100元"]
[92,312697,"5獎：穀王購物金100元"]
[93,320516,"5獎：穀王購物金100元"]
[94,324960,"5獎：穀王購物金100元"]
[95,341110,"5獎：穀王購物金100元"]
[96,345651,"5獎：穀王購物金100元"]
[97,346265,"5獎：穀王購物金100元"]
[98,346981,"5獎：穀王購物金100元"]
[99,351838,"5獎：穀王購物金100元"]
[100,354602,"5獎：穀王購物金100元"]
[101,357292,"5獎：穀王購物金100元"]
[102,385575,"5獎：穀王購物金100元"]
[103,386769,"5獎：穀王購物金100元"]
[104,388854,"5獎：穀王購物金100元"]
[105,389677,"5獎：穀王購物金100元"]
[106,399821,"5獎：穀王購物金100元"]
[107,404003,"5獎：穀王購物金100元"]
[108,405380,"5獎：穀王購物金100元"]
[109,406913,"5獎：穀王購物金100元"]
[110,414673,"5獎：穀王購物金100元"]
[111,420354,"5獎：穀王購物金100元"]
[112,451718,"5獎：穀王購物金100元"]
[113,452609,{"$f":"$C$48","v":"5獎：穀王購物金100元"}]
[114,487200,"5獎：穀王購物金100元"]
[115,496272,"5獎：穀王購物金100元"]
[116,496983,"5獎：穀王購物金100元"]
[117,530517,"5獎：穀王購物金100元"]
[118,562786,"5獎：穀王購物金100元"]
[119,564841,"5獎：穀王購物金100元"]
[120,566772,"5獎：穀王購物金100元"]
[121,617123,"5獎：穀王購物金100元"]
[122,625147,"5獎：穀王購物金100元"]
[123,626759,"5獎：穀王購物金100元"]
[124,702793,"5獎：穀王購物金100元"]
[125,711127,"5獎：穀王購物金100元"]
[126,729703,"5獎：穀王購物金100元"]
[127,729704,"5獎：穀王購物金100元"]
[128,790047,"5獎：穀王購物金100元"]
[129,791340,"5獎：穀王購物金100元"]
[130,794184,"5獎：穀王購物金100元"]
[131,795352,"5獎：穀王購物金100元"]
[132,796105,"5獎：穀王購物金100元"]
[133,799827,"5獎：穀王購物金100元"]
[134,837620,"5獎：穀王購物金100元"]
[135,838896,"5獎：穀王購物金100元"]
[136,839502,"5獎：穀王購物金100元"]
[137,850499,"5獎：穀王購物金100元"]
[138,855523,"5獎：穀王購物金100元"]
[139,855530,"5獎：穀王購物金100元"]
[140,855698,"5獎：穀王購物金100元"]
[141,857740,"5獎：穀王購物金100元"]
[142,858333,"5獎：穀王購物金100元"]
[143,859217,"5獎：穀王購物金100元"]
[144,866513,"5獎：穀王購物金100元"]
[145,866514,"5獎：穀王購物金100元"]
[146,866515,"5獎：穀王購物金100元"]
[147,14735,"6獎：喜互惠購物金100元"]
[148,16321,{"$f":"$C$148","v":"6獎：喜互惠購物金100元"}]
[149,20285,{"$f":"$C$148","v":"6獎：喜互惠購物金100元"}]
[150,40125,"6獎：喜互惠購物金100元"]
[151,45136,"6獎：喜互惠購物金100元"]
[152,46699,"6獎：喜互惠購物金100元"]
[153,49010,"6獎：喜互惠購物金100元"]
[154,51816,"6獎：喜互惠購物金100元"]
[155,73326,"6獎：喜互惠購物金100元"]
[156,75711,"6獎：喜互惠購物金100元"]
[157,98270,"6獎：喜互惠購物金100元"]
[158,104460,"6獎：喜互惠購物金100元"]
[159,126851,"6獎：喜互惠購物金100元"]
[160,131945,"6獎：喜互惠購物金100元"]
[161,134720,"6獎：喜互惠購物金100元"]
[162,136051,"6獎：喜互惠購物金100元"]
[163,136364,"6獎：喜互惠購物金100元"]
[164,136709,"6獎：喜互惠購物金100元"]
[165,164680,"6獎：喜互惠購物金100元"]
[166,180216,"6獎：喜互惠購物金100元"]
[167,188657,"6獎：喜互惠購物金100元"]
[168,218574,"6獎：喜互惠購物金100元"]
[169,222975,"6獎：喜互惠購物金100元"]
[170,256228,"6獎：喜互惠購物金100元"]
[171,259439,"6獎：喜互惠購物金100元"]
[172,262895,"6獎：喜互惠購物金100元"]
[173,280573,"6獎：喜互惠購物金100元"]
[174,284376,"6獎：喜互惠購物金100元"]
[175,284667,"6獎：喜互惠購物金100元"]
[176,285312,"6獎：喜互惠購物金100元"]
[177,286570,"6獎：喜互惠購物金100元"]
[178,287006,"6獎：喜互惠購物金100元"]
[179,289575,"6獎：喜互惠購物金100元"]
[180,293765,"6獎：喜互惠購物金100元"]
[181,299524,"6獎：喜互惠購物金100元"]
[182,319822,"6獎：喜互惠購物金100元"]
[183,322564,"6獎：喜互惠購物金100元"]
[184,323576,"6獎：喜互惠購物金100元"]
[185,324177,"6獎：喜互惠購物金100元"]
[186,351470,"6獎：喜互惠購物金100元"]
[187,351660,"6獎：喜互惠購物金100元"]
[188,353033,"6獎：喜互惠購物金100元"]
[189,357385,"6獎：喜互惠購物金100元"]
[190,358873,"6獎：喜互惠購物金100元"]
[191,375774,"6獎：喜互惠購物金100元"]
[192,381571,"6獎：喜互惠購物金100元"]
[193,382019,"6獎：喜互惠購物金100元"]
[194,382417,"6獎：喜互惠購物金100元"]
[195,384682,"6獎：喜互惠購物金100元"]
[196,390978,"6獎：喜互惠購物金100元"]
[197,397798,"6獎：喜互惠購物金100元"]
[198,402090,"6獎：喜互惠購物金100元"]
[199,405397,"6獎：喜互惠購物金100元"]
[200,405555,"6獎：喜互惠購物金100元"]
[201,408709,"6獎：喜互惠購物金100元"]
[202,409095,"6獎：喜互惠購物金100元"]
[203,452917,"6獎：喜互惠購物金100元"]
[204,455704,"6獎：喜互惠購物金100元"]
[205,458148,"6獎：喜互惠購物金100元"]
[206,492985,"6獎：喜互惠購物金100元"]
[207,494252,"6獎：喜互惠購物金100元"]
[208,496679,"6獎：喜互惠購物金100元"]
[209,535315,"6獎：喜互惠購物金100元"]
[210,537604,"6獎：喜互惠購物金100元"]
[211,591018,"6獎：喜互惠購物金100元"]
[212,603559,"6獎：喜互惠購物金100元"]
[213,616027,{"$f":"$C$148","v":"6獎：喜互惠購物金100元"}]
[214,625725,"6獎：喜互惠購物金100元"]
[215,631142,"6獎：喜互惠購物金100元"]
[216,647671,"6獎：喜互惠購物金100元"]
[217,673147,"6獎：喜互惠購物金100元"]
[218,721828,"6獎：喜互惠購物金100元"]
[219,725817,"6獎：喜互惠購物金100元"]
[220,760468,"6獎：喜互惠購物金100元"]
[221,761643,"6獎：喜互惠購物金100元"]
[222,765633,"6獎：喜互惠購物金100元"]
[223,765636,"6獎：喜互惠購物金100元"]
[224,773174,"6獎：喜互惠購物金100元"]
[225,790104,"6獎：喜互惠購物金100元"]
[226,792274,"6獎：喜互惠購物金100元"]
[227,792668,"6獎：喜互惠購物金100元"]
[228,794930,"6獎：喜互惠購物金100元"]
[229,796882,"6獎：喜互惠購物金100元"]
[230,798532,"6獎：喜互惠購物金100元"]
[231,800435,"6獎：喜互惠購物金100元"]
[232,802326,"6獎：喜互惠購物金100元"]
[233,831120,"6獎：喜互惠購物金100元"]
[234,831125,"6獎：喜互惠購物金100元"]
[235,831126,"6獎：喜互惠購物金100元"]
[236,831950,"6獎：喜互惠購物金100元"]
[237,832519,"6獎：喜互惠購物金100元"]
[238,837103,"6獎：喜互惠購物金100元"]
[239,838060,"6獎：喜互惠購物金100元"]
[240,838777,"6獎：喜互惠購物金100元"]
[241,838851,"6獎：喜互惠購物金100元"]
[242,857414,"6獎：喜互惠購物金100元"]
[243,858998,"6獎：喜互惠購物金100元"]
[244,859394,"6獎：喜互惠購物金100元"]
[245,863020,"6獎：喜互惠購物金100元"]
[246,865615,"6獎：喜互惠購物金100元"]